{"text_format":"1","workbook":"xlsx","n_sheets":2,"sheets":["Brasil Conta Comigo_DB","REF"],"not_rendered":{"charts":0,"images":2,"macros":1,"external_links":0,"defined_names":5,"comments":0,"pivot_tables":0},"unopened":[],"bounds":{"document_bytes":16777216,"sheet_cells":100000,"rows_first":2000,"rows_last":500,"rows_between":2000,"halvings":0,"cell_chars":16384,"cell_head_chars":4096},"cells_cut":0,"cells_raw":0,"read":"whole","date_system":"1900"}

{"sheet":"Brasil Conta Comigo_DB","index":0,"n_rows":2006,"n_cols":16,"rows_kept":2006,"cut":false,"hidden":false,"merged":[[3,0,3,1],[0,0,0,13],[2,12,2,13],[2,0,2,8],[3,4,3,8],[3,11,3,13]]}
["Ação estratégica \"O Brasil Conta Comigo – Residentes na área de Saúde\" "]
[{"$f":"SUBTOTAL(103,A6:A2005)","v":0},{"$f":"SUBTOTAL(103,B6:B2005)","v":0},null,null,0,0,0,0,0,null,null,0,0,0,{"$f":"AND(A2=B2,A2=E2,A2=E2,A2=F2,A2=G2,A2=H2,A2=I2,A2=L2,A2=M2,A2=N2)","v":true},{"$f":"IF(AVERAGE(A2:N2)=0,\"Tabela não preenchida\",IF(O2,\"Não há informações pendentes\",\"HÁ CAMPOS EM BRANCO!\"))","v":"Tabela não preenchida"}]
["ATENÇÃO, todas as colunas da planilha devem ser preenchidas!\nNão serão aceitas planilhas com informações pendentes",null,null,null,null,null,null,null,null,null,null,{"$f":"IF(M3=\"Não há informações pendentes\",CONCATENATE(\"Total de Residentes Informados: \",SUBTOTAL(3,$E$6:$E$2005)),M3)","v":"Tabela não preenchida"},{"$f":"P2","v":"Tabela não preenchida"}]
["Informação instituição",null,null,null,"Informação Residente",null,null,null,null,null,null,"Informação Bancária"]
["Nome da Instituição","CNPJ\n(Apenas dígitos)","Tipo de Residência(Escolher Residência Médica ou Residência em Área Profissional da Saúde)","Nome do Programa","Nome do Residente","N.° CPF\n(Apenas dígitos)","E-mail do residente","Status do Residente  (múltipla escolha)","Sub-status (múltipla escolha)\n(Se Inativo)","Ano de residência","Fonte Pagadora da Bolsa","Nome e Número do banco","Número da agência SEM DÍGITO VERIFICADOR","Conta Corrente COM DÍGITO VERIFICADOR"]
[]
[]
[]
[]
[]
[]
[]
[]
[]
[]
[]
[]
[]
[]
[]
[]
[]
[]
[]
[]
[]
[]
[]
[]
[]
[]
[]
[]
[]
[]
[]
[]
[]
[]
[]
[]
[]
[]
[]
[]
[]
[]
[]
[]
[]
[]
[]
[]
[]
[]
[]
[]
[]
[]
[]
[]
[]
[]
[]
[]
[]
[]
[]
[]
[]
[]
[]
[]
[]
[]
[]
[]
[]
[]
[]
[]
[]
[]
[]
[]
[]
[]
[]
[]
[]
[]
[]
[]
[]
[]
[]
[]
[]
[]
[]
[]
[]
[]
[]
[]
[]
[]
[]
[]
[]
[]
[]
[]
[]
[]
[]
[]
[]
[]
[]
[]
[]
[]
[]
[]
[]
[]
[]
[]
[]
[]
[]
[]
[]
[]
[]
[]
[]
[]
[]
[]
[]
[]
[]
[]
[]
[]
[]
[]
[]
[]
[]
[]
[]
[]
[]
[]
[]
[]
[]
[]
[]
[]
[]
[]
[]
[]
[]
[]
[]
[]
[]
[]
[]
[]
[]
[]
[]
[]
[]
[]
[]
[]
[]
[]
[]
[]
[]
[]
[]
[]
[]
[]
[]
[]
[]
[]
[]
[]
[]
[]
[]
[]
[]
[]
[]
[]
[]
[]
[]
[]
[]
[]
[]
[]
[]
[]
[]
[]
[]
[]
[]
[]
[]
[]
[]
[]
[]
[]
[]
[]
[]
[]
[]
[]
[]
[]
[]
[]
[]
[]
[]
[]
[]
[]
[]
[]
[]
[]
[]
[]
[]
[]
[]
[]
[]
[]
[]
[]
[]
[]
[]
[]
[]
[]
[]
[]
[]
[]
[]
[]
[]
[]
[]
[]
[]
[]
[]
[]
[]
[]
[]
[]
[]
[]
[]
[]
[]
[]
[]
[]
[]
[]
[]
[]
[]
[]
[]
[]
[]
[]
[]
[]
[]
[]
[]
[]
[]
[]
[]
[]
[]
[]
[]
[]
[]
[]
[]
[]
[]
[]
[]
[]
[]
[]
[]
[]
[]
[]
[]
[]
[]
[]
[]
[]
[]
[]
[]
[]
[]
[]
[]
[]
[]
[]
[]
[]
[]
[]
[]
[]
[]
[]
[]
[]
[]
[]
[]
[]
[]
[]
[]
[]
[]
[]
[]
[]
[]
[]
[]
[]
[]
[]
[]
[]
[]
[]
[]
[]
[]
[]
[]
[]
[]
[]
[]
[]
[]
[]
[]
[]
[]
[]
[]
[]
[]
[]
[]
[]
[]
{"$rows_left_out":1607}
{"sheet":"REF","index":1,"n_rows":283,"n_cols":5,"rows_kept":283,"cut":false,"hidden":true,"merged":[]}
["Ativo","Inativo","Ano da Residencia","Tipo de Residência\n(Residência Médica/Residência em Área Profissional da Saúde)","Fonte Pagadora da Bolsa"]
["Residente Ativo","Atestado Médico","R1","Residência Médica","Ministério da Educação"]
[null,"Afastamento Programado (Férias)","R2","Residência em Área Profissional da Saúde","Ministério da Defesa"]
[null,"Caso Confirmado de COVID-19 ","R3",null,"Secretária Estadual de Saúde"]
[null,"Licença de mais de 30 dias","R4",null,"Secretária Municipal de Saúde"]
[null,"Desligado","R5",null,"Secretária  de Saúde do Distrito Federal"]
[null,"Trancamento","R6",null,"Ministério da Saúde"]
[null,"Ausência não Justificada","R7",null,"Recurso Próprio"]
[null,"Recusou Atendimento","R8"]
[null,null,"R9"]
[null,null,"R10"]
[null,null,"Concluído"]
["Tabela não preenchida"]
["Não há informações pendentes"]
["HÁ CAMPOS EM BRANCO!"]
[]
[]
["001 - BANCO DO BRASIL S.A."]
["003 - BANCO DA AMAZONIA S.A."]
["004 - BANCO DO NORDESTE DO BRASIL S.A."]
["007 - BANCO NACIONAL DE DESENV.ECONOMICO E SOCIAL"]
["010 - CC CREDICOAMO CREDITO RURAL COOPERATIVA"]
["011 - CREDIT SUISSE HEDGING-GRIFFO CORRETORA S.A."]
["012 - BANCO INBURSA DE INVESTIMENTOS S.A."]
["014 - STATE STREET BRASIL S.A. BCO COMERCIAL"]
["016 - SICOOB CREDITRAN"]
["017 - BNY MELLON BANCO S.A."]
["018 - BANCO TRICURY S.A."]
["021 - BANCO DO ESTADO DO ESPIRITO SANTO S.A."]
["024 - BANCO BANDEPE S.A."]
["025 - BANCO ALFA S.A."]
["029 - BANCO ITAU CONSIGNADO S.A."]
["033 - BANCO SANTANDER (BRASIL)S.A."]
["036 - BANCO BRADESCO BBI"]
["037 - BANCO DO ESTADO DO PARA S.A."]
["040 - BANCO CARGILL S.A."]
["041 - BANCO DO ESTADO DO RIO GRANDE DO SUL S.A."]
["047 - BANCO DO ESTADO DE SERGIPE S.A."]
["060 - CONFIDENCE CORRETORA DE CAMBIO S.A"]
["062 - HIPERCARD BANCO MULTIPLO S.A"]
["063 - BANCO BRADESCARD S.A."]
["064 - GOLDMAN SACHS DO BRASIL BANCO MULTIPLO SA"]
["065 - BANCO ANDBANK (BRASIL) S.A."]
["066 - BANCO MORGAN STANLEY DEAN WITTER S.A."]
["069 - BANCO CREFISA S.A."]
["070 - BRB-BANCO DE BRASILIA S.A."]
["074 - BANCO J.SAFRA S.A."]
["075 - BCO ABN AMRO S.A."]
["076 - KDB DO BRASIL"]
["077 - BANCO INTERMEDIUM S.A"]
["078 - BI HAITONG DO BRASIL"]
["079 - BANCO ORIGINAL DO AGRONEGOCIO S.A."]
["080 - B&T ASSOCIADOS CORRETORA DE CAMBIO LTDA"]
["081 - BANCO SEGURO S.A."]
["082 - BANCO TOPAZIO S.A."]
["083 - BANCO DA CHINA BRASIL S.A."]
["084 - CC UNIPRIME NORTE DO PARANA"]
["085 - CCC AILOS"]
["088 - BANCO RANDON S.A"]
["089 - CREDISAN COOPERATIVA DE CREDITO"]
["091 - CC UNICRED CENTRAL RS"]
["092 - BRK S.A CREDITO, FINANCIAMENTO E INVEST."]
["093 - POLOCRED SOCIEDADE CREDITO MICROEMPREENDEDOR"]
["094 - BANCO FINAXIS S.A."]
["095 - TRAVELEX BANCO DE CAMBIO S.A."]
["096 - BANCO B3 S.A."]
["097 - CREDISIS LTDA"]
["098 - CREDIALIANCA COOPERATIVA CREDITO RURAL"]
["099 - UNIPRIME CENTRAL"]
["100 - PLANNER CORRETORA DE VALORES S.A."]
["101 - DTVM RENANSCENCA"]
["102 - XP INVESTIMENTOS CCTVM S.A."]
["104 - CAIXA ECONOMICA FEDERAL"]
["105 - LECCA CREDITO, FINACIAMENTO E INVESTIMENTO"]
["107 - BANCO BOCOM BBM S.A."]
["108 - PORTOCRED S.A. CREDITO, FINANCIAMENTO E INV."]
["111 - OLIVEIRA TRUST DIST. DE TITULOS E VALORES SA."]
["113 - MAGLIANO S/A CORRETORA DE CAMBIO VALORES MOB"]
["114 - CENTRAL COOP.CRED. ESTADO ESP. SANTO CECOOP"]
["117 - ADVANCED CORRETORA DE CAMBIO LTDA"]
["119 - WESTERN UNION DO BRASIL S.A."]
["120 - BANCO RODOBENS S.A."]
["121 - BANCO AGIBANK S.A."]
["122 - BANCO BERJ S.A."]
["124 - BANCO WOORI BANK DO BRASIL S.A."]
["125 - BRASIL PLURAL S.A. BANCO MULTIPLO"]
["126 - BR PARTNERS BANCO DE INVESTIMENTO S.A."]
["127 - CODEPE-CORRETORA DE VALORES S.A."]
["128 - MSB BANK S.A. BANCO DE CAMBIO"]
["129 - UBS BRASIL BANCO DE INVESTIMENTO S.A."]
["130 - CARUANA S.A. SOCIEDADE CREDITO, FINAC. E INV."]
["131 - TULLETT PREBON BRASIL-CORRETORA VALORES"]
["132 - ICBC DO BRASIL"]
["133 - CRESOL CONFEDERACAO"]
["134 - BGC LIQUIDEZ DISTR.TITULOS E VAL. MOBILIARIOS"]
["136 - CC UNICRED DO BRASIL"]
["138 - SC GET MONEY"]
["139 - INTENSA SANPAOLO"]
["140 - SC EASYNVEST"]
["142 - BROKER BRASIL CORRETORA DE CAMBIO LTDA"]
["143 - TREVISO CORRETORA DE CAMBIO S.A."]
["144 - BEXS_BANCO DE CAMBIO S/A"]
["145 - SC LEVYCAM"]
["146 - SC GUITTA"]
["149 - SCFI FACTA FINANCEIRA"]
["157 - ICAP DO BRASIL CORRETORA DE TíTULOS E VALORES"]
["159 - CASA DO CREDITO S.A. SOCIEDADE DE CREDITO AO"]
["163 - COMMERZBANK BRASIL S.A. - BANCO MULTIPLO"]
["169 - OLÉ BONSUCESSO CONSIGNADO"]
["173 - BRL TRUST DTVM S.A."]
["174 - SCFI PERNAMBUCANAS"]
["177 - GUIDE INVESTIMENTOS S.A. CORRETORA DE VALORES"]
["180 - SC CM CAPITAL MARKETS"]
["183 - SOCRED S.A. - SOC.DE CRED. AO MICROEMP.E EPP"]
["184 - BANCO ITAU-BBA S.A."]
["188 - ATIVA INVESTIMENTOS S.S. CORRETORA DE TITULOS"]
["189 - HS FINANCEIRA S.A. CREDITO, FIN. E INVEST."]
["190 - COOP. DE ECONOMIA E CREDITO MUTUO SERV. PUBL."]
["191 - NOVA FUTURA CORRETORA DE TÍTULOS E VAL. MOB."]
["194 - PARMETAL DISTRIB. TIT. E VALORES MOBILIARIOS"]
["196 - SC FAIR"]
["197 - STONE PAGAMENTOS S.A."]
["204 - BRADESCO CARTOES"]
["208 - BTG PACTUAL S.A."]
["212 - BANCO ORIGINAL S.A."]
["213 - BANCO ARBI S.A."]
["214 - BANCO DIBENS S.A."]
["217 - BANCO JOHN DEERE S.A."]
["218 - BANCO BS2 S.A."]
["222 - BANCO CREDIT AGRICOLE BRASIL S.A."]
["224 - BANCO FIBRA S/A"]
["233 - BANCO CIFRA S.A."]
["237 - BANCO BRADESCO SA"]
["241 - BANCO CLASSICO S.A."]
["243 - BANCO MAXIMA S.A."]
["246 - BANCO ABC BRASIL S.A."]
["249 - BANCO INVESTCRED UNIBANCO S.A."]
["250 - BANCO DE CREDITO E VAREJO S.A."]
["253 - BEXS CORRETORA DE CAMBIO S/A"]
["254 - PARANA BANCO S.A."]
["259 - MONEYCORP BANCO DE CÂMBIO SA"]
["260 - NU PAGAMENTOS S.A."]
["265 - BANCO FATOR S.A"]
["266 - BANCO CEDULA S/A"]
["268 - BARI COMPANHIA HIPOTECARIA"]
["269 - BANCO HSBC S.A."]
["270 - SAGITUR CORRETORA DE CAMBIO LTDA."]
["271 - IB CCTVM LTDA"]
["272 - AGK CORRETORA DE CAMBIO S.A."]
["273 - COOP. DE CRED. RURAL DE SAO MIGUEL DO OESTE"]
["274 - MONEY PLUS SCMEPP LTDA"]
["276 - SENFF S.A. - CRED. FINANC. E INVESTIMENTO"]
["278 - GENIAL INVESTIMENTOS CVM S.A."]
["279 - COOP. CRED. RURAL DE PRIMAVERA DO LESTE"]
["280 - AVISTA S.A. CREDITO, FINANC. E INVESTIMENTO"]
["281 - COOPERATIVA DE CREDITO RURAL COOPAVEL"]
["283 - RB CAPITAL INVESTIM. DTVM LTDA."]
["285 - FRENTE CORRETORA DE CAMBIO LTDA"]
["286 - COOPERATIVA DE CREDITO RURAL DE OURO SULCREDI"]
["288 - CAROL DTVM LTDA"]
["289 - DECYSEO CORRETORA DE CAMBIO LTDA"]
["290 - PAGSEGURO INTERNET S.A."]
["292 - BS2 DISTRIBUIDORA TIT. VALORES MOBILIARIOS SA"]
["293 - LASTRO RDV DTVM LTDA"]
["296 - VISION S.A. CORRETORA DE CAMBIO"]
["298 - VIP'S CORRETORA DE CAMBIO LTDA SA"]
["299 - SOROCRED CREDITO, FIN. E INVESTIMENTO SA"]
["300 - BANCO DE LA NACION ARGENTINA"]
["301 - BPP INSTITUICAO DE PAGAMENTO S.A."]
["306 - PORTOPAR DTVM LTDA"]
["307 - TERRA INVEST. DISTRIB. DE TIT.VALORES IMOBILI"]
["309 - CAMBIONET CORRETORA DE CAMBIO LTDA."]
["310 - VORTX DISTRIB. TIT. E VAL. MOBILIARIOS LTDA."]
["315 - PI DISTRIBUIDORA DE TIT. E VAL. MOBILIARIOS"]
["318 - BANCO BMG S.A."]
["319 - OM DISTRIB.TITULOS E VALORES MOBILIARIOS LTDA"]
["320 - CCB BRASIL"]
["321 - CREFAZ SCMEPP LTDA"]
["322 - COOPERATIVA DE CREDITO RURAL DE ABELARDO LUZ"]
["323 - MERCADOPAGO.COM REPRESENTACOES LTDA"]
["324 - CARTOS SOCIEDADE DE CRÉDITO DIRETO S.A."]
["325 - ORAMA DISTRIB. TITULOS E VALORES MOBILIARIOS"]
["326 - PARATI CREDITO, FINANCIAMENTO E INVESTIM. S/A"]
["329 - QI SOCIEDADE DE CREDITO DIRETO S.A."]
["330 - BANCO BARI DE INVESTIMENTOS E FINANCIAMENTOS"]
["331 - FRAM CAPITAL DTVM S.A."]
["332 - ACESSO SOLUCOES DE PAGAMENTO S.A."]
["335 - BANCO DIGIO S.A."]
["336 - BANCO C6 S.A."]
["340 - SUPER PAGAMENTOS E ADM. MEIOS ELETRONICOS SA."]
["341 - BANCO ITAU UNIBANCO S.A."]
["342 - CREDITAS SOCIEDADE DE CREDITO DIRETO S.A."]
["343 - FFA SCMEPP LTDA"]
["348 - BANCO XP S.A."]
["349 - AMAGGI S.A.-CREDITO,FINANCIAMENTO E INVEST."]
["350 - COOP. DE CRED. RURAL DE PEQUENOS AGRICULT."]
["352 - TORO CORRETORA DE TITULOS E VAL. MOBILIARIOS"]
["354 - NECTON INVESTIMENTOS S.A. CVM"]
["355 - OTIMO SOCIEDADE DE CREDITO DIRETO S.A."]
["359 - ZEMA CREDITO, FINANC. E INVESTIMENTO S.A."]
["360 - TRINUS CAPITAL DTVM S.A."]
["362 - CIELO S.A."]
["363 - SOCOPA SOCIEDADE CORRETORA PAULISTA S.A."]
["364 - GERENCIANET PAGAMENTOS DO BRASIL LTDA"]
["365 - SOLIDUS S.A CTVM"]
["366 - BANCO SOCIETE GENERALE BRASIL S.A."]
["367 - VITREO DTVM S.A."]
["368 - BANCO CSF S.A."]
["370 - BANCO MIZUHO DO BRASIL S.A."]
["371 - WARREN CORRETORA DE VALORES MOBILIARIOS E CAM"]
["373 - U.P.P SOCIEDADE EMPRÉSTIMO ENTRE PESSOAS S.A"]
["374 - REALIZE CREDITO, FINANC. E INVESTIMENTO S.A."]
["376 - BANCO J.P.MORGAN S.A."]
["377 - MS SOCIEDADE DE CREDITO AO MICROEMPREENDEDOR"]
["378 - BBC LEASING S.A. - ARRENDAMENTO MERCANTIL"]
["379 - COOPERFORTE - COOP. ECON. E CRED. MUTUO F. IF"]
["380 - PICPAY SERVICOS S.A."]
["381 - BANCO MERCEDES-BENZ DO BRASIL SA"]
["382 - FIDUCIA SOCIEDADE DE CREDITO"]
["383 - BOLETOBANCÁRIO.COM TECNOLOGIA DE PAGAMENTOS L"]
["384 - GLOBAL FINANÇAS SOCIEDADE DE CRÉDITO AO MICR"]
["387 - BANCO TOYOTA DO BRASIL S.A."]
["389 - BANCO MERCANTIL DO BRASIL S.A."]
["390 - BANCO GM S.A."]
["391 - COOP. CREDITO RURAL DE IBIAM - SULCREDI/IBIAM"]
["393 - BANCO VOLKSWAGEN S.A."]
["394 - BRADESCO FINANCIAMENTOS S.A."]
["395 - GOLD DISTRIB. TÍTULOS E VALORES MOBILIARIOS"]
["396 - HUB PAGAMENTOS S.A"]
["397 - LISTO SOCIEDADE DE CREDITO DIRETO S.A."]
["399 - KIRTON BANK S.A.- BANCO MULTIPLO"]
["403 - CORA SOCIEDADE DE CRÉDITO DIRETO S.A."]
["404 - SUMUP SOCIEDADE DE CRÉDITO DIRETO S.A."]
["406 - ACCREDITO - SOCIEDADE DE CRÉDITO DIRETO S.A."]
["408 - BONUSCRED SOCIEDADE DE CREDITO DIRETO S.A."]
["412 - BANCO CAPITAL S.A."]
["422 - BANCO SAFRA S.A."]
["456 - BANCO MUFG BRASIL S.A."]
["464 - BANCO SUMITOMO MITSUI BRASILEIRO S.A."]
["473 - BANCO CAIXA GERAL - BRASIL S.A."]
["477 - CITIBANK N.A."]
["479 - BANCO ITAUBANK S.A."]
["487 - DEUTSCHE BANK S.A.BANCO ALEMAO"]
["488 - JPMORGAN CHASE BANK"]
["492 - ING BANK N.V."]
["494 - BANCO DE LA REPUBLICA ORIENTAL DEL URUGUAY"]
["495 - BANCO DE LA PROVINCIA DE BUENOS AIRES"]
["505 - BANCO CREDIT SUISSE FIRST BOSTON GARANTIA S."]
["545 - SENSO CORRETORA CAMBIO E VALORES MOBILIARIOS"]
["600 - BANCO LUSO BRASILEIRO S/A"]
["604 - BANCO INDUSTRIAL DO BRASIL S/A"]
["610 - BANCO VR S.A."]
["611 - BANCO PAULISTA S/A"]
["612 - BANCO GUANABARA S.A."]
["613 - OMNI BANCO S.A."]
["623 - BANCO PAN S.A."]
["626 - BANCO FICSA S/A"]
["630 - BANCO SMARTBANK S.A."]
["633 - BANCO RENDIMENTO S.A."]
["634 - BANCO TRIANGULO S/A"]
["637 - BANCO SOFISA S/A"]
["643 - BANCO PINE S.A."]
["652 - BANCO ITAU UNIBANCO_HOLDING"]
["653 - BANCO INDUSVAL S/A"]
["654 - BANCO DIGIMAIS S.A."]
["655 - BANCO VOTORANTIM S/A"]
["707 - BANCO DAYCOVAL S.A."]
["712 - BM OURINVEST"]
["738 - BANCO MORADA S/A"]
["739 - CETELEM"]
["741 - BANCO RIBEIRAO PRETO S/A"]
["743 - BANCO SEMEAR S/A"]
["745 - BANCO CITIBANK S/A"]
["746 - BANCO MODAL S/A"]
["747 - BANCO RABOBANK INTERNATIONAL BRASIL S.A."]
["748 - BANCO COOPERATIVO SICREDI S.A."]
["751 - SCOTIABANK BRASIL S.A. BANCO MULTIPLO"]
["752 - BANCO BNP PARIBAS BRASIL S.A."]
["753 - NBC BANK BRASIL S.A."]
["754 - BANCO SISTEMA"]
["755 - BANCO MERRILL LYNCH S/A"]
["756 - BANCO COOPERATIVO DO BRASIL S/A"]
["757 - BANCO KEB HANA DO BRASIL S.A."]